*HEADING
This file was created for the AnyBody-Abaqus interface demonstration purpose
*NODE
*ELEMENT, TYPE=C3D4, ELSET=allelements
*SOLID SECTION, MATERIAL=BONE, ELSET=allelements
*MATERIAL, NAME=BONE
*ELASTIC, TYPE=ISO
5000000, 0.3, 10